{"text_format":"1","workbook":"xlsx","n_sheets":12,"sheets":["Vejledning","Registrering","Type","Tværprofilelement","Spor","Bitumen","Stenmateriale","Kornkurve","EntrKoder","Referencelinjer","Eksempel på registrering","Ark1"],"not_rendered":{"charts":0,"images":4,"macros":1,"external_links":1,"defined_names":12,"comments":0,"pivot_tables":0},"unopened":[],"bounds":{"document_bytes":16777216,"sheet_cells":100000,"rows_first":2000,"rows_last":500,"rows_between":2000,"halvings":0,"cell_chars":16384,"cell_head_chars":4096},"cells_cut":0,"cells_raw":0,"read":"whole","date_system":"1900"}

{"sheet":"Vejledning","index":0,"n_rows":7,"n_cols":1,"rows_kept":7,"cut":false,"hidden":false,"merged":[]}
["Belægningsregistrering i vejman.dk"]
["Den egentlige registrering foregår på fanebladet ”Registrering”. Der er udfyldt én række med ét eksempel. Række 4 angiver de muligheder der er for at udfylde den pågældende kolonne, adskilt med /."]
["De steder hvor der står ”Se faneblad”, er der et tilhørende faneblad med samme navn, som selve kolonnen. Fanebladet angiver hvilke værdier der kan vælges i kolonnen. Det er ”Bruger kode” (angivet med gult) der kan inddateres i den tilhørende kolonne på registreringsfanebladet. De steder hvor valget er Ja/Nej indtastes kun Ja (=1), ikke udfyldte felter opfattes som Nej."]
["Såfremt der til belægningstypen er angivet en vægtfylde i værdilisten, så kan man nøjes med at angive en af værdierne mængde [kg/m2] eller tykkelse [mm]. Den ikke angivne værdi vil automatisk blive udregnet på det tidspunkt, at data ajourføres i vejman.dk.\n "]
["Hver række i arket repræsenterer ét belægningsarbejde. Så snart der en ændring i laget, fx ændring i mængden fra 60 kg/m2 til 80 kg/m2, så registreres der på en ny række. HUSK at det er ”Udlæg slut dato”, der angiver hvilket lag, der er nederst. Men følger man bare de faktiske udlægningstidspunkter, ja så kommer det til at passe. I det tilfælde hvor der er tale om samme udlægningsdag for f.eks. ABB og SMA bør datoen for ABB justeres med en dag, så dette lag kommer nederst."]
["Ved valg af vejside og tværprofilelement er der følgende specielle værdier:\n• Vejside = Alle\n• Tværprofilelement = Alle kørespor inkl. kantbaner\nNår man vælger den ene eller begge disse værdier, bliver belægningsarbejdet stedfæstet i forhold til oplysningerne i tværprofilregistret. Det har to formål:\n• Man sikrer, at der er overensstemmelse mellem oplysningerne i tværprofilregistret og belægningsregistret (i ajourføringsøjeblikket). Man får ikke lagt et belægningsarbejde ud på et sted, hvor det angivne tværprofilelement ikke findes.\n• Man kan slippe med at registrere én post (plade) frem for flere.\nDet er valgfrit om man vil gøre brug af disse specielle værdier. Man skal ikke bruge dem, hvis kvaliteten af data i tværprofilregistret er tvivlsom."]
["BEMÆRK at det er hele vejens opbygning der skal inddateres, ikke bare GAB + ABB + Slidlag, men også bundsikring, stabil grus osv."]

{"sheet":"Registrering","index":1,"n_rows":299,"n_cols":26,"rows_kept":299,"cut":false,"hidden":false,"merged":[[3,9,3,24],[3,0,3,7],[0,0,0,2],[0,3,0,6],[0,7,0,10],[0,11,0,13],[0,14,0,15],[0,16,0,17],[1,0,1,2],[1,3,1,6],[1,7,1,10],[1,11,1,13],[1,14,1,15],[1,16,1,17]]}
["DATO",null,null,"DOKUMENT",null,null,null,"SAGSBEHANDLER",null,null,null,"MAIL",null,null,"TELEFON",null,"SAP-opgavenummer",null,null,null,null,null,null,null,null," "]
[null,null,null,null,null,null,null,null,null,null,null,null,null,null,null,null,null,null,null,null,null,null,null,null,null," "]
[null,null,null,null,null,null,null,null,null,null,null,null,null,null,null,null,null,null,null,null,null,null,null,null,null," "]
["Stedfæstelse",null,null,null,null,null,null,null,null,"Belægning"]
["Admvejnr.","Admvejdel","km","m","km","m","Vejside","Tværprofilelement","Tvær. kode","Type","Forsøgsbel.","Støjreduc.","Mængde","Tykkelse","Modificeret","Bitumen","Lyst tilslag","Stenmateriale","Kornkurve","Udlægn slut dato","Bemærkning","Entreprenørnavn","Entreprenør ID","Affræst tykkelse","Afhjælpningsdato","Partiel"]
[null,null,null,null,null,null,"Alle/H/V","Alle kørespor incl kantbane / Nødspor","Automatisk","Se faneblad","Ja/Nej","Ja/Nej","kg/m2","mm","Ja/Nej","Se faneblad","Ja/Nej","Se faneblad","Se faneblad",null,"Valgfri bemærkning","Se faneblad","Automatisk","mm",null,"Ja/Nej"]
[" "," "," "," "," "," ","Alle ",null,{"$f":"LOOKUP(H7,Tværprofilelement!C3:C24,Tværprofilelement!A3:A24)","v":{"$error":"#N/A"}},null,null,null,null,null,null,null,null,null,null,null,null,null,{"$f":"LOOKUP(V7,EntrKoder!B$1:B$10,EntrKoder!A$1:A$10)","v":{"$error":"#N/A"}},null," "," "]
[" "," "," "," "," "," ","Alle ",null,{"$f":"LOOKUP(H8,Tværprofilelement!C$3:C$24,Tværprofilelement!A$3:A$24)","v":{"$error":"#N/A"}},null,null,null,null,null,null,null,null,null,null,null,null,null,{"$f":"LOOKUP(V8,EntrKoder!B$1:B$10,EntrKoder!A$1:A$10)","v":{"$error":"#N/A"}},null," "," "]
[" "," "," "," "," "," ","Alle ",null,{"$f":"LOOKUP(H9,Tværprofilelement!C$3:C$24,Tværprofilelement!A$3:A$24)","v":{"$error":"#N/A"}},null,null,null,null,null,null,null,null,null,null,null,null,null,{"$f":"LOOKUP(V9,EntrKoder!B$1:B$10,EntrKoder!A$1:A$10)","v":{"$error":"#N/A"}},null," "," "]
[" "," "," "," "," "," ","Alle ",null,{"$f":"LOOKUP(H10,Tværprofilelement!C$3:C$24,Tværprofilelement!A$3:A$24)","v":{"$error":"#N/A"}},null,null,null,null,null,null,null,null,null,null,null,null,null,{"$f":"LOOKUP(V10,EntrKoder!B$1:B$10,EntrKoder!A$1:A$10)","v":{"$error":"#N/A"}},null," "," "]
[" "," "," "," "," "," ","Alle ",null,{"$f":"LOOKUP(H11,Tværprofilelement!C$3:C$24,Tværprofilelement!A$3:A$24)","v":{"$error":"#N/A"}},null,null,null,null,null,null,null,null,null,null,null,null,null,{"$f":"LOOKUP(V11,EntrKoder!B$1:B$10,EntrKoder!A$1:A$10)","v":{"$error":"#N/A"}},null," "," "]
[" "," "," "," "," "," ","Alle ",null,{"$f":"LOOKUP(H12,Tværprofilelement!C$3:C$24,Tværprofilelement!A$3:A$24)","v":{"$error":"#N/A"}},null,null,null,null,null,null,null,null,null,null,null,null,null,{"$f":"LOOKUP(V12,EntrKoder!B$1:B$10,EntrKoder!A$1:A$10)","v":{"$error":"#N/A"}},null," "," "]
[" "," "," "," "," "," ","Alle ",null,{"$f":"LOOKUP(H13,Tværprofilelement!C$3:C$24,Tværprofilelement!A$3:A$24)","v":{"$error":"#N/A"}},null,null,null,null,null,null,null,null,null,null,null,null,null,{"$f":"LOOKUP(V13,EntrKoder!B$1:B$10,EntrKoder!A$1:A$10)","v":{"$error":"#N/A"}},null," "," "]
[" "," "," "," "," "," ","Alle ",null,{"$f":"LOOKUP(H14,Tværprofilelement!C$3:C$24,Tværprofilelement!A$3:A$24)","v":{"$error":"#N/A"}},null,null,null,null,null,null,null,null,null,null,null,null,null,{"$f":"LOOKUP(V14,EntrKoder!B$1:B$10,EntrKoder!A$1:A$10)","v":{"$error":"#N/A"}},null," "," "]
[" "," "," "," "," "," ","Alle ",null,{"$f":"LOOKUP(H15,Tværprofilelement!C$3:C$24,Tværprofilelement!A$3:A$24)","v":{"$error":"#N/A"}},null,null,null,null,null,null,null,null,null,null,null,null,null,{"$f":"LOOKUP(V15,EntrKoder!B$1:B$10,EntrKoder!A$1:A$10)","v":{"$error":"#N/A"}},null," "," "]
[" "," "," "," "," "," ","Alle ",null,{"$f":"LOOKUP(H16,Tværprofilelement!C$3:C$23,Tværprofilelement!A$3:A$23)","v":{"$error":"#N/A"}},null,null,null,null,null,null,null,null,null,null,null,null,null,{"$f":"LOOKUP(V16,EntrKoder!B$1:B$10,EntrKoder!A$1:A$10)","v":{"$error":"#N/A"}},null," "," "]
[" "," "," "," "," "," ","Alle ",null,{"$f":"LOOKUP(H17,Tværprofilelement!C$3:C$24,Tværprofilelement!A$3:A$24)","v":{"$error":"#N/A"}},null,null,null,null,null,null,null,null,null,null,null,null,null,{"$f":"LOOKUP(V17,EntrKoder!B$1:B$10,EntrKoder!A$1:A$10)","v":{"$error":"#N/A"}},null," "," "]
[" "," "," "," "," "," ","Alle ",null,{"$f":"LOOKUP(H18,Tværprofilelement!C$3:C$24,Tværprofilelement!A$3:A$24)","v":{"$error":"#N/A"}},null,null,null,null,null,null,null,null,null,null,null,null,null,{"$f":"LOOKUP(V18,EntrKoder!B$1:B$10,EntrKoder!A$1:A$10)","v":{"$error":"#N/A"}},null," "," "]
[" "," "," "," "," "," ","Alle ",null,{"$f":"LOOKUP(H19,Tværprofilelement!C$3:C$24,Tværprofilelement!A$3:A$24)","v":{"$error":"#N/A"}},null,null,null,null,null,null,null,null,null,null,null,null,null,{"$f":"LOOKUP(V19,EntrKoder!B$1:B$10,EntrKoder!A$1:A$10)","v":{"$error":"#N/A"}},null," "," "]
[" "," "," "," "," "," ","Alle ",null,{"$f":"LOOKUP(H20,Tværprofilelement!C$3:C$24,Tværprofilelement!A$3:A$24)","v":{"$error":"#N/A"}},null,null,null,null,null,null,null,null,null,null,null,null,null,{"$f":"LOOKUP(V20,EntrKoder!B$1:B$10,EntrKoder!A$1:A$10)","v":{"$error":"#N/A"}},null," "," "]
{"$rows_left_out":280}
{"sheet":"Type","index":2,"n_rows":118,"n_cols":5,"rows_kept":118,"cut":false,"hidden":false,"merged":[[0,0,0,4]]}
["Opdateret 2024-08-01 (tp3)"]
["Id","Kode","Tekst","Beskrivelse","Vgtf"]
[1,"AA","Andet afretningslag","Andet afretningslag",2.25]
[2,"AB","Asfaltbeton","Asfaltbeton",2.35]
[3,"ABB","Asfaltbeton binderlag","Asfaltbeton binderlag",2.25]
[7,"ABS","Asfaltbeton med nedtr. skærver","Asfaltbeton med nedtromlede skærver",2.35]
[8,"ABST","Asfaltbeton med stålslagger","Asfaltbeton med stålslagger",2.35]
[9,"ABU","Asfaltbundlag","Asfaltbundlag",2.25]
[114,"ABÅ","Asfaltbeton åben","Asfaltbeton åben",2.35]
[12,"ACB","Andet cementbundet bærelag","Andet cementbundet bærelag",0]
[86,"AFF","Affaset kantsten","Affaset kantsten",0]
[13,"AFFR","Affræsning","Affræsning",2.25]
[14,"AS","Andet slidlag","Andet slidlag",2.35]
[15,"ASB","Andet stab. bundsikringslag","Andet stabiliseret bundsikringslag",0]
[134,"ASF","Asfalt","Asfalt",2.35]
[16,"ASU","Andet stabiliseret underbund","Andet stabiliseret underbund",0]
[17,"AUB","Andet ubundet bærelag","Andet ubundet bærelag",0]
[18,"AUS","Andet ubundet bundsikringslag","Andet ubundet bundsikringslag",0]
[87,"BELS","Belægningssten","Belægningssten",0]
[88,"BEPL","Beplantning","Beplantning",0]
{"$rows_left_out":99}
{"sheet":"Tværprofilelement","index":3,"n_rows":27,"n_cols":3,"rows_kept":27,"cut":false,"hidden":false,"merged":[]}
["Opdateret 2024-10-01 (tp3)"]
["Kode",null,"Tekst"]
[501,null,"Alle spor inkl. kantbaner"]
[62,null,"Cykelsti"]
[61,null,"Fortov"]
[5,null,"Højre spor"]
[10,null,"Højre svingspor 1"]
[11,null,"Højre svingspor 2"]
[12,null,"Højre svingspor 3"]
[4,null,"Kørebane"]
[57,null,"Mellembane"]
[7,null,"Midt højre spor"]
[8,null,"Midt venstre spor"]
[1,null,"Midterrabat"]
[6,null,"Midterspor"]
[58,null,"Midtkantbane"]
[2,null,"Nødrabat"]
[3,null,"Nødspor"]
[63,null,"Sti"]
[9,null,"Venstre spor"]
{"$rows_left_out":8}
{"sheet":"Spor","index":4,"n_rows":90,"n_cols":25,"rows_kept":90,"cut":false,"hidden":false,"merged":[[70,2,70,10],[70,13,70,23],[1,2,1,24],[8,3,8,24],[44,2,44,24],[50,5,50,9],[50,15,50,21]]}
[]
[null,null,"Benævnelser af spor"]
[]
[]
[null,null,null,"Vejsiden identificeres i kilometreringsretningen som højre (H) og venstre (V)"]
[]
[null,null,null,"Vognbane er i kørselsretningen (Højre vognbane er altid \"det tunge/langsomme\" spor)"]
[]
[null,null,null,"Svingbaner benævnes  \"H\" eller \"V\" efter hvilken side de svinger til og \"S\" for sving. Herefter nummereres fra vejmidte (set i kørselretning) og ud mod vejsiderne."]
[]
[null,null,null,"OBS: Spor, hvor mere end en retning er mulig, benævnes som \"lige ud\"-spor."]
[]
[]
[]
[]
[]
[]
[]
[]
[]
{"$rows_left_out":71}
{"sheet":"Bitumen","index":5,"n_rows":18,"n_cols":6,"rows_kept":18,"cut":false,"hidden":false,"merged":[]}
[]
["Id","Kode","Brugerkode","Tekst","Brugertekst","Beskrivelse"]
[1,"AND","AND","ANDET","ANDET",";"]
[2,"B100","B100","B100","B100",";"]
[3,"B120","B120","B120","B120",";"]
[4,"B200","B200","B200","B200",";"]
[5,"B30","B30","B30","B30",";"]
[6,"B45","B45","B45","B45",";"]
[7,"B700","B700","B700","B700",";"]
[8,"B80","B80","B80","B80",";"]
[9,"E70","E70","E70","E70","Bitumenemulsion 70 R"]
[10,"100/","100/","100/150","100/150",";"]
[11,"160/","160/","160/220","160/220","Tidligere B180"]
[12,"250/","250/","250/330","250/330","Tidligere B300"]
[13,"30/","30/","30/55","30/55",";"]
[14,"330/","330/","330/430","330/430","Tidligere B500"]
[15,"40/","40/","40/60","40/60","Tidligere B60"]
[16,"70/","70/","70/100","70/100","Tidligere B85"]

{"sheet":"Stenmateriale","index":6,"n_rows":9,"n_cols":6,"rows_kept":9,"cut":false,"hidden":false,"merged":[]}
[]
["Id","Kode","Brugerkode","Tekst","Brugertekst","Beskrivelse"]
[6,"AND","AND","Andet","Andet","Andet"]
[2,"BAKK","BAKK","Bakkemateriale","Bakkemateriale","Bakkemateriale"]
[4,"ELEK","ELEK","Elektroslagger","Elektroslagger","Elektroslagger"]
[3,"KLIP","KLIP","Klippemateriale fx granit","Klippemateriale fx granit","Klippemateriale fx granit"]
[5,"SYNT","SYNT","Syntetisk materiale","Syntetisk materiale","Syntetisk materiale"]
[1,"SØ","SØ","Søsten","Søsten","Søsten"]
[7,0,0,0,0,0]

{"sheet":"Kornkurve","index":7,"n_rows":40,"n_cols":6,"rows_kept":40,"cut":false,"hidden":false,"merged":[]}
[]
["Id","Kode","Brugerkode","Tekst","Brugertekst","Beskrivelse"]
[2,99,99,0,0,";"]
[10,1,1,"0/6","0/6",";"]
[38,35,35,"0/6+8","0/6+8",";"]
[39,36,36,"0/6+11","0/6+11",";"]
[11,2,2,"0/8","0/8",";"]
[3,3,3,"0/10","0/10",";"]
[4,4,4,"0/12","0/12",";"]
[5,5,5,"0/16","0/16",";"]
[6,6,6,"0/20","0/20",";"]
[7,7,7,"0/22","0/22",";"]
[8,8,8,"0/25","0/25",";"]
[9,9,9,"0/40","0/40",";"]
[23,33,33,"2/5","2/5",";"]
[24,14,14,"4T","4T",";"]
[25,11,11,"5/8","5/8",";"]
[26,32,32,6,6,";"]
[27,23,23,"6K","6K",";"]
[28,15,15,"6T","6T",";"]
{"$rows_left_out":21}
{"sheet":"EntrKoder","index":8,"n_rows":10,"n_cols":4,"rows_kept":10,"cut":false,"hidden":false,"merged":[]}
[21883929,"Arkil A/S - 1","Aastrupvej 19","6100 Haderslev"]
[21883932,"Colas A/S - 1"]
[21883942,"DOB - Dansk Overflade Behandling"]
[21884014,"Lemminkäinen A/S - 1","Parketvej 1","4600 Køge"]
[3588714,"M.J. Erikson A/S","Gl. Køge landevej","2660 Brøndby"]
[4792843,"Munck-Asfalt","Slipshavnsvej","5800 Nyborg"]
[3587546,"NCC roads A/S","Vestre Hedevej","4000 Roskilde"]
[21883969,"Pankas A/S - 3","Rundforbivej 34","2950 Vedbæk"]
[21884094,"Skanska A/S","Vejlevej 14","8700 Horsens"]
[24387574,"Strabag"]

{"sheet":"Referencelinjer","index":9,"n_rows":72,"n_cols":14,"rows_kept":72,"cut":false,"hidden":false,"merged":[]}
[null,null,null,null,null,null,null,null,null,null,null,null,null,"Det er endvidere muligt at indberette sideanlægstilslutninger som selvstændige vejdele ved brug af 2 cifre."]
[null,null,null,null,null,null,null,null,null,null,null,null,null,"Vejdelsfeltet er nu blevet på 8 karakterer, så forskellige former af nummerering af kommuneveje "]
[null,null,null,null,null,null,null,null,null,null,null,null,null,"også kan bevares ved oprettelse af disse i vejman.dk."]
[null,null,null,null,null,null,null,null,null,null,null,null,null,"11 (+ evt. bogstav): større sideanlæg højre side (typisk motorveje)"]
[null,null,null,null,null,null,null,null,null,null,null,null,null,"12 (+ evt. bogstav): større sideanlæg venstre side (typisk motorveje)"]
[null,null,null,null,null,null,null,null,null,null,null,null,null,"13 til 19: anvendes som 11 & 12, men til fri anvendelse af andre sideanlæg med selvstændig ind- & udkørsel."]
[]
[null,null,null,null,null,null,null,null,null,null,null,null,null,"Se figur 4 – 5."]
[]
[]
[]
[]
[]
[]
[]
[]
[]
[]
[]
[]
{"$rows_left_out":53}
{"sheet":"Eksempel på registrering","index":10,"n_rows":49,"n_cols":26,"rows_kept":49,"cut":false,"hidden":false,"merged":[[0,0,0,7],[0,9,0,24],[1,2,1,3],[1,4,1,5]]}
["Stedfæstelse",null,null,null,null,null,null,null,null,0]
[null,null,"Frakmt",null,"Tilkmt"]
["Admvejnr.","Admvejdel","km","m","km","m","Vejside","Tværprofilelement","Tvær. kode","Type","Forsøgsbel.","Støjreduc.","Mængde","Tykkelse","Modificeret","Bitumen","Lyst tilslag","Stenmateriale","Kornkurve","Udlægn slut dato","Bemærkning","Entreprenørnavn","Entreprenør ID","Affræst tykkelse","Afhjælpningsdato","Entr_id_Konvvej"]
[null,null,null,null,null,null,"Alle/H/V","Alle kørespor incl kantbane / Nødspor","Automatisk","Se faneblad","Ja/Nej","Ja/Nej","kg/m2","mm","Ja/Nej","Se faneblad","Ja/Nej","Se faneblad","Se faneblad",null,"Valgfri bemærkning","Se fanblad","Automatisk","mm"]
[429,0,5,932,6,32,"Alle ","Alle spor incl. Kantbane",{"$error":"#N/A"},"SMA",null,null,80,null,"Ja","40/",null,"KLIP","0/12","2012-09-17","E. 42910.20","Lemminkäinen A/S - 1",21884014,null,"2017-10-05",16741226]
[429,0,5,932,11,77,"Alle ","Alle spor incl. Kantbane",{"$error":"#N/A"},"ABB",null,null,150,null,"Ja","40/",null,"KLIP","0/16","2012-06-26","E. 42910.20","Lemminkäinen A/S - 1",21884014,null,"2017-10-05",16741226]
[429,0,5,932,11,77,"Alle ","Alle spor incl. Kantbane",{"$error":"#N/A"},"GAB2",null,null,225,null,"Nej","40/",null,"BAKK","0/22","2012-06-19","E. 42910.20","Lemminkäinen A/S - 1",21884014,null,"2017-10-05",16741226]
[429,0,5,932,11,77,"Alle ","Alle spor incl. Kantbane",{"$error":"#N/A"},"SG2",null,null,null,200,null,null,null,null,null,"2012-05-30","E. 42910.20","Strabag",24387574,null,"2017-10-05",16817289]
[429,0,5,932,11,77,"Alle ","Alle spor incl. Kantbane",{"$error":"#N/A"},"BL2",null,null,null,415,null,null,null,null,null,"2012-04-30","E. 42910.20","Strabag",24387574,null,"2017-10-05",16817289]
[429,0,6,32,10,602,"Alle ","Alle spor incl. Kantbane",{"$error":"#N/A"},"SMA",null,"Ja",55,null,"Ja","40/",null,"KLIP","0/6+8","2012-09-17",null,"Lemminkäinen A/S - 1",21884014,null,"2017-10-05",16741226]
[429,0,10,645,11,77,"Alle ","Alle spor incl. Kantbane",{"$error":"#N/A"},"SMA",null,"Ja",50,null,"Ja","40/",null,"KLIP","0/6+8","2012-09-25",null,"Lemminkäinen A/S - 1",21884014,null,"2017-10-05",16741218]
[429,1,10,602,10,670,"Alle ","Alle spor incl. Kantbane",{"$error":"#N/A"},"SMA",null,null,80,null,"Ja","40/","Ja","KLIP","0/12","2012-09-06","E. 42910.20",null,{"$error":"#N/A"},null,"2017-10-05"]
[429,1,10,602,10,670,"Alle ","Alle spor incl. Kantbane",{"$error":"#N/A"},"ABB",null,null,155,null,"Ja","40/",null,"KLIP","0/16","2011-07-04","E. 42910.20","Strabag",24387574,null,"2016-09-01",16817289]
[429,1,10,602,10,670,"Alle ","Alle spor incl. Kantbane",{"$error":"#N/A"},"GAB2",null,null,225,null,"Nej","40/",null,"BAKK","0/22","2011-07-01","E. 42910.20","Strabag",24387574,null,"2016-09-01",16817289]
[429,1,10,602,10,670,"Alle ","Alle spor incl. Kantbane",{"$error":"#N/A"},"SG2",null,null,null,200,null,null,null,null,null,"2011-06-01","E. 42910.20","Strabag",24387574,null,"2016-09-01",16817289]
[429,1,10,602,10,670,"Alle ","Alle spor incl. Kantbane",{"$error":"#N/A"},"BL2",null,null,null,417,null,null,null,null,null,"2011-05-01","E. 42910.20","Strabag",24387574,null,"2016-09-01",16817289]
[429,2,10,602,10,669,"Alle ","Alle spor incl. Kantbane",{"$error":"#N/A"},"SMA",null,null,80,null,"Ja","40/","Ja","KLIP","0/12","2012-09-06","E. 42910.20","Lemminkäinen A/S - 1",21884014,null,"2017-10-05",16741226]
[429,2,10,602,10,669,"Alle ","Alle spor incl. Kantbane",{"$error":"#N/A"},"ABB",null,null,155,null,"Ja","40/",null,"KLIP","0/16","2011-07-04","E. 42910.20","Strabag",24387574,null,"2016-09-01",16817289]
[429,2,10,602,10,669,"Alle ","Alle spor incl. Kantbane",{"$error":"#N/A"},"GAB2",null,null,225,null,"Nej","40/",null,"BAKK","0/22","2011-07-01","E. 42910.20","Strabag",24387574,null,"2016-09-01",16817289]
[429,2,10,602,10,669,"Alle ","Alle spor incl. Kantbane",{"$error":"#N/A"},"SG2",null,null,null,200,null,null,null,null,null,"2011-06-01","E. 42910.20","Strabag",24387574,null,"2016-09-01",16817289]
{"$rows_left_out":30}
{"sheet":"Ark1","index":11,"n_rows":26,"n_cols":10,"rows_kept":26,"cut":false,"hidden":false,"merged":[]}
[]
[]
[]
[]
[]
[null,"Alle spor incl. Kantbane"]
[null,"Nødrabat",null,null,"Alle ","Ja",null,1,null,1]
[null,"Nødspor",null,null,"Højre","Nej"]
[null,"Kørebane",null,null,"Venstre"]
[null,"Højre spor",null,null,"Midt"]
[null,"Midterspor"]
[null,"Midt højre spor"]
[null,"Midt venstre spor"]
[null,"Venstre spor"]
[null,"Højre svingspor 1"]
[null,"Højre svingspor 2"]
[null,"Højre svingspor 3"]
[null,"Venstre svingspor 1"]
[null,"Venstre svingspor 2"]
[null,"Venstre svingspor 3"]
{"$rows_left_out":6}